BDBM354891 US9815790, 6
SMILES COCCOCCOCCOCCOCCOCCOCCOCCOCCOCCOCCNC(=O)CCCCCOc1cc(NC2CCN(CC2)S(=O)(=O)C(F)(F)F)c2cc(ccc2n1)C(c1ccc(Cl)cc1)c1ccc(Cl)cc1
InChI Key InChIKey=FBVUXDGYGCGPNW-UHFFFAOYSA-N
Data  2 EC50
  Tab Delimited (TSV)   2D SDfile   Computed 3D by Vconf -m prep SDfile
Find this compound or compounds like it in BindingDB:
Activity Spreadsheet -- Enzyme Inhibition Constant Data from BindingDB
Found 2 hits for monomerid = 354891
TargetCannabinoid receptor 2(Homo sapiens (Human))
Janssen Pharmaceutica
US Patent
LigandPNGBDBM354891(US9815790, 6)
Affinity DataEC50:  3.00E+3nM. Assay description: Cells plated the day prior to the assay in clear bottom plates were viewed on an inverse microscope to ensure confluency in the range of 60-75%. The ...
Ligand InfoPC cidPC sid
In DepthDetails US Patent
TargetCannabinoid receptor 1(Homo sapiens (Human))
Janssen Pharmaceutica
US Patent
LigandPNGBDBM354891(US9815790, 6)
Affinity DataEC50:  19nM. Assay description: Cells plated the day prior to the assay in clear bottom plates were viewed on an inverse microscope to ensure confluency in the range of 60-75%. The ...
Ligand InfoPC cidPC sid
In DepthDetails US Patent