BDBM35505 2-[4-(2,6-dimethylmorpholino)sulfonylbenzoyl]imino-3,4-dimethyl-4-thiazoline-5-carboxylic acid ethyl ester::2-[[4-[(2,6-dimethyl-4-morpholinyl)sulfonyl]phenyl]-oxomethyl]imino-3,4-dimethyl-5-thiazolecarboxylic acid ethyl ester::MLS000087878::SMR000024197::cid_3238028::ethyl (2Z)-2-({4-[(2,6-dimethylmorpholin-4-yl)sulfonyl]benzoyl}imino)-3,4-dimethyl-2,3-dihydro-1,3-thiazole-5-carboxylate::ethyl 2-[4-(2,6-dimethylmorpholin-4-yl)sulfonylbenzoyl]imino-3,4-dimethyl-1,3-thiazole-5-carboxylate::ethyl 2-[4-(2,6-dimethylmorpholin-4-yl)sulfonylphenyl]carbonylimino-3,4-dimethyl-1,3-thiazole-5-carboxylate
SMILES CCOC(=O)c1s\c(=N\C(=O)c2ccc(cc2)S(=O)(=O)N2CC(C)OC(C)C2)n(C)c1C
InChI Key InChIKey=AQQCXDMXFHJVGK-QURGRASLSA-N
Data  3 IC50
  Tab Delimited (TSV)   2D SDfile   Computed 3D by Vconf -m prep SDfile
Find this compound or compounds like it in BindingDB:
Activity Spreadsheet -- Enzyme Inhibition Constant Data from BindingDB
Found 3 hits for monomerid = 35505
TargetCathepsin B(Homo sapiens (Human))
Pcmd
Curated by PubChem BioAssay
LigandPNGBDBM35505(2-[4-(2,6-dimethylmorpholino)sulfonylbenzoyl]imino...)
Affinity DataIC50: >5.00E+4nMpH: 6.8 T: 2°C. Assay description: Screening Center: Penn Center for Molecular Discovery Center Affiliation: University of Pennsylvania Network: Molecular Library Screening Center Netw...
In DepthDetails PCBioAssay
TargetProcathepsin L(Homo sapiens (Human))
Pcmd
Curated by PubChem BioAssay
LigandPNGBDBM35505(2-[4-(2,6-dimethylmorpholino)sulfonylbenzoyl]imino...)
Affinity DataIC50: >5.00E+4nM. Assay description: Screening Center: Penn Center for Molecular Discovery Center Affiliation: University of Pennsylvania Network: Molecular Library Screening Center Netw...
In DepthDetails PCBioAssay
TargetCathepsin B(Homo sapiens (Human))
Pcmd
Curated by PubChem BioAssay
LigandPNGBDBM35505(2-[4-(2,6-dimethylmorpholino)sulfonylbenzoyl]imino...)
Affinity DataIC50: >5.00E+4nM. Assay description: Screening Center: Penn Center for Molecular Discovery Center Affiliation: University of Pennsylvania Network: Molecular Library Screening Center Netw...
In DepthDetails PCBioAssay