BDBM35510 2-[2-(4-amino-1,2,5-oxadiazol-3-yl)-1-benzimidazolyl]-N-(2-butoxyphenyl)acetamide::2-[2-(4-amino-1,2,5-oxadiazol-3-yl)-1H-benzimidazol-1-yl]-N-(2-butoxyphenyl)acetamide::2-[2-(4-amino-1,2,5-oxadiazol-3-yl)benzimidazol-1-yl]-N-(2-butoxyphenyl)acetamide::2-[2-(4-aminofurazan-3-yl)benzimidazol-1-yl]-N-(2-butoxyphenyl)acetamide::2-[2-(4-azanyl-1,2,5-oxadiazol-3-yl)benzimidazol-1-yl]-N-(2-butoxyphenyl)ethanamide::MLS000043839::SMR000021050::cid_3240826
SMILES CCCCOc1ccccc1NC(=O)Cn1c(nc2ccccc12)-c1nonc1N
InChI Key InChIKey=WUOMFTQBSOWCGO-UHFFFAOYSA-N
Data  6 IC50
  Tab Delimited (TSV)   2D SDfile   Computed 3D by Vconf -m prep SDfile
Find this compound or compounds like it in BindingDB:
Activity Spreadsheet -- Enzyme Inhibition Constant Data from BindingDB
Found 6 hits for monomerid = 35510
TargetCathepsin B(Homo sapiens (Human))
Pcmd
Curated by PubChem BioAssay
LigandPNGBDBM35510(2-[2-(4-amino-1,2,5-oxadiazol-3-yl)-1-benzimidazol...)
Affinity DataIC50:  2.81E+4nMpH: 6.8 T: 2°C. Assay description: Screening Center: Penn Center for Molecular Discovery Center Affiliation: University of Pennsylvania Network: Molecular Library Screening Center Netw...
In DepthDetails PCBioAssay
TargetCathepsin B(Homo sapiens (Human))
Pcmd
Curated by PubChem BioAssay
LigandPNGBDBM35510(2-[2-(4-amino-1,2,5-oxadiazol-3-yl)-1-benzimidazol...)
Affinity DataIC50:  2.81E+4nM. Assay description: Screening Center: Penn Center for Molecular Discovery Center Affiliation: University of Pennsylvania Network: Molecular Library Screening Center Netw...
In DepthDetails PCBioAssay
TargetProcathepsin L(Homo sapiens (Human))
Pcmd
Curated by PubChem BioAssay
LigandPNGBDBM35510(2-[2-(4-amino-1,2,5-oxadiazol-3-yl)-1-benzimidazol...)
Affinity DataIC50: >5.00E+4nM. Assay description: Screening Center: Penn Center for Molecular Discovery Center Affiliation: University of Pennsylvania Network: Molecular Library Screening Center Netw...
In DepthDetails PCBioAssay
TargetIsoform 2 of Nuclear receptor ROR-alpha (Alpha-2)(Homo sapiens (Human))
The Scripps Research Institute Molecular Screening Center
Curated by PubChem BioAssay
LigandPNGBDBM35510(2-[2-(4-amino-1,2,5-oxadiazol-3-yl)-1-benzimidazol...)
Affinity DataIC50:  1.16E+4nM. Assay description: Source (MLSCN Center Name): The Scripps Research Institute Molecular Screening Center Center Affiliation: The Scripps Research Institute, TSRI Assay ...
In DepthDetails PCBioAssay
TargetSteroidogenic factor 1(Homo sapiens (Human))
The Scripps Research Institute Molecular Screening Center
Curated by PubChem BioAssay
LigandPNGBDBM35510(2-[2-(4-amino-1,2,5-oxadiazol-3-yl)-1-benzimidazol...)
Affinity DataIC50: >3.67E+3nM. Assay description: Source (MLSCN Center Name): The Scripps Research Institute Molecular Screening Center Center Affiliation: The Scripps Research Institute, TSRI Assay ...
In DepthDetails PCBioAssay
TargetProcathepsin L(Homo sapiens (Human))
Pcmd
Curated by PubChem BioAssay
LigandPNGBDBM35510(2-[2-(4-amino-1,2,5-oxadiazol-3-yl)-1-benzimidazol...)
Affinity DataIC50:  4.04E+3nM. Assay description: Screening Center: Penn Center for Molecular Discovery Center Affiliation: University of Pennsylvania Network: Molecular Library Screening Center Netw...
In DepthDetails PCBioAssay