BDBM355640 (1R,3S,5R)-2-[2-(3-Acetyl- pyrazolo[3,4-c]pyridin-1-yl)-acetyl]- 2-aza-bicyclo[3.1.0] hexane-3- carboxylic acid ((1R,2S)-2-phenyl- cyclopropyl)-amide::US9815819, 5
SMILES CC(=O)c1nn(CC(=O)N2[C@@H]3C[C@@H]3C[C@H]2C(=O)N[C@@H]2C[C@H]2c2ccccc2)c2cnccc12
InChI Key InChIKey=AQXXCJBRJWXMNC-PPQDBTBKSA-N
Data  1 IC50
  Tab Delimited (TSV)   2D SDfile   Computed 3D by Vconf -m prep SDfile
Find this compound or compounds like it in BindingDB:
Activity Spreadsheet -- Enzyme Inhibition Constant Data from BindingDB
Found 1 hit for monomerid = 355640
TargetComplement factor D(Homo sapiens (Human))
Novartis
US Patent
LigandPNGBDBM355640((1R,3S,5R)-2-[2-(3-Acetyl- pyrazolo[3,4-c]pyridin-...)
Affinity DataIC50:  106nM. Assay description: Method 1: Recombinant human factor D (expressed in E. coli and purified using standard methods) at 10 nM concentration is incubated with test compoun...
Ligand InfoPC cidPC sid
In DepthDetails US Patent