BDBM355825 US9815836, Compound 10
SMILES CN1CCNC(=O)c2nn(C)cc2NC(=O)c2cccc(n2)-c2cnn(CC1)c2
InChI Key InChIKey=SRPZQITYKMNCOH-UHFFFAOYSA-N
Data  2 IC50
  Tab Delimited (TSV)   2D SDfile   Computed 3D by Vconf -m prep SDfile
Find this compound or compounds like it in BindingDB:
Activity Spreadsheet -- Enzyme Inhibition Constant Data from BindingDB
Found 2 hits for monomerid = 355825
TargetInterleukin-1 receptor-associated kinase 4(Homo sapiens (Human))
Merck Patent
US Patent
LigandPNGBDBM355825(US9815836, Compound 10)
Affinity DataIC50:  550nM. Assay description: IRAK4 is a human purified recombinant enzyme (His-TEV-IRAK4 (1-460)).In this assay, IRAK4 hydrolyses ATP, autophosphorylates and phosphorylates a Ser...
Ligand InfoPC cidPC sid
In DepthDetails US Patent
TargetInterleukin-1 receptor-associated kinase 1 [194-712](Homo sapiens (Human))
Merck Patent
US Patent
LigandPNGBDBM355825(US9815836, Compound 10)
Affinity DataIC50:  3.00E+3nM. Assay description: IRAK1 is a human purified recombinant enzyme (His-TEV-IRAK1 (194-712))In this assay, IRAK1 hydrolyses ATP and autophosphorylates. Measurement of IRAK...
Ligand InfoPC cidPC sid
In DepthDetails US Patent