BDBM355926 1-(5-chloro-6-(2H- 1,2,3-triazol-2- yl)pyridin-3-yl)-3-(2- chloro-7-(1- (methoxymethyl)cyclo- butyl)pyrazolo[1,5- a]pyrimidin-6-yl)urea::US10442808, Example 50::US9815842, Example 50
SMILES COCC1(CCC1)c1c(NC(=O)Nc2cnc(c(Cl)c2)-n2nccn2)cnc2cc(Cl)nn12
InChI Key InChIKey=NEEXNJHZUXWYGG-UHFFFAOYSA-N
Data  2 IC50
  Tab Delimited (TSV)   2D SDfile   Computed 3D by Vconf -m prep SDfile
Find this compound or compounds like it in BindingDB:
Activity Spreadsheet -- Enzyme Inhibition Constant Data from BindingDB
Found 2 hits for monomerid = 355926
LigandPNGBDBM355926(1-(5-chloro-6-(2H- 1,2,3-triazol-2- yl)pyridin-3-y...)
Affinity DataIC50:  0.0200nM. Assay description: The assay employs a short peptide substrate labeled with the single fluorophore PT14 as a fluorescence lifetime probe sensitive to the cleavage state...
Ligand InfoPC cidPC sid
In DepthDetails US Patent
TargetMucosa-associated lymphoid tissue lymphoma translocation protein 1(Homo sapiens (Human))
Novartis
US Patent
LigandPNGBDBM355926(1-(5-chloro-6-(2H- 1,2,3-triazol-2- yl)pyridin-3-y...)
Affinity DataIC50:  0.0200nM. Assay description: IC50 values of test compounds were determined with an enzyme activity assay using the C-domain of MALT1 (amino acids 329-824). The readout parameter ...
Ligand InfoPC cidPC sid
In DepthDetails US Patent