BDBM35593 pyrazolo pyrimidine, 25
SMILES COC(=O)N1CCC(CC1)n1ncc2c(nc(nc12)-c1ccc(NC(=O)Nc2ccncc2)cc1)N1CCOCC1
InChI Key InChIKey=PNVCJWPREJZASR-UHFFFAOYSA-N
Data  2 IC50
  Tab Delimited (TSV)   2D SDfile   Computed 3D by Vconf -m prep SDfile
Find this compound or compounds like it in BindingDB:
Activity Spreadsheet -- Enzyme Inhibition Constant Data from BindingDB
Found 2 hits for monomerid = 35593
LigandPNGBDBM35593(pyrazolo pyrimidine, 25)
Affinity DataIC50:  18nMT: 2°C. Assay description: Inhibition of PI3K enzyme activity is measured in a microtiter plate-based fluorescence polarization (FP) assay.
In DepthDetails ArticlePubMed
TargetSerine/threonine-protein kinase mTOR(Homo sapiens (Human))
Wyeth Research
LigandPNGBDBM35593(pyrazolo pyrimidine, 25)
Affinity DataIC50:  0.300nMpH: 7.4 T: 2°C. Assay description: The enzyme was assayed in DELFIA format using purified FLAG-TOR in kinase buffer containing ATP and His6-S6K in the presence of inhibitor compounds. ...
In DepthDetails ArticlePubMed