BDBM355956 1-(2-chloro-7-(2- (tetrahydro-2H- pyran-4-yl)propan-2- yl)pyrazolo[1,5- a]pyrimidin-6-yl)-3- (2- (trifluoromethyl)pyri- din-4-yl)urea::US10442808, Example 80::US9815842, Example 80
SMILES CC(C)(C1CCOCC1)c1c(NC(=O)Nc2ccnc(c2)C(F)(F)F)cnc2cc(Cl)nn12
InChI Key InChIKey=PTPDVFDUHCJQLR-UHFFFAOYSA-N
Data  2 IC50
  Tab Delimited (TSV)   2D SDfile   Computed 3D by Vconf -m prep SDfile
Find this compound or compounds like it in BindingDB:
Activity Spreadsheet -- Enzyme Inhibition Constant Data from BindingDB
Found 2 hits for monomerid = 355956
LigandPNGBDBM355956(1-(2-chloro-7-(2- (tetrahydro-2H- pyran-4-yl)propa...)
Affinity DataIC50:  0.0340nM. Assay description: The assay employs a short peptide substrate labeled with the single fluorophore PT14 as a fluorescence lifetime probe sensitive to the cleavage state...
Ligand InfoPC cidPC sid
In DepthDetails US Patent
TargetMucosa-associated lymphoid tissue lymphoma translocation protein 1(Homo sapiens (Human))
Novartis
US Patent
LigandPNGBDBM355956(1-(2-chloro-7-(2- (tetrahydro-2H- pyran-4-yl)propa...)
Affinity DataIC50:  0.0340nM. Assay description: IC50 values of test compounds were determined with an enzyme activity assay using the C-domain of MALT1 (amino acids 329-824). The readout parameter ...
Ligand InfoPC cidPC sid
In DepthDetails US Patent