BDBM35633 5-chloroindolecarboxamide, 9h
SMILES OCC(O)c1ccc(NC(=O)c2cc3cc(Cl)ccc3[nH]2)cc1C(F)(F)F
InChI Key InChIKey=YWSABJGARDVRIO-UHFFFAOYSA-N
Data  1 IC50
  Tab Delimited (TSV)   2D SDfile   Computed 3D by Vconf -m prep SDfile
Find this compound or compounds like it in BindingDB:
Activity Spreadsheet -- Enzyme Inhibition Constant Data from BindingDB
Found 1 hit for monomerid = 35633
TargetGlycogen phosphorylase, liver form(Homo sapiens (Human))
Astellas Pharma
LigandPNGBDBM35633(5-chloroindolecarboxamide, 9h)
Affinity DataIC50:  340nMpH: 6.8 T: 2°C. Assay description: The activity of recombinant human liver GPa in the forward direction was measured by monitoring the production of NADPH. Enzyme activity was assayed...
In DepthDetails ArticlePubMed