BDBM35639 5-chloroindolecarboxamide, 15a
SMILES OCC(O)c1csc(NC(=O)c2cc3cc(Cl)ccc3[nH]2)n1
InChI Key InChIKey=NHRCUMOGCMNBTH-UHFFFAOYSA-N
Data  1 IC50
  Tab Delimited (TSV)   2D SDfile   Computed 3D by Vconf -m prep SDfile
Find this compound or compounds like it in BindingDB:
Activity Spreadsheet -- Enzyme Inhibition Constant Data from BindingDB
Found 1 hit for monomerid = 35639
TargetGlycogen phosphorylase, liver form(Homo sapiens (Human))
Astellas Pharma
LigandPNGBDBM35639(5-chloroindolecarboxamide, 15a)
Affinity DataIC50: >1.00E+4nMpH: 6.8 T: 2°C. Assay description: The activity of recombinant human liver GPa in the forward direction was measured by monitoring the production of NADPH. Enzyme activity was assayed...
Ligand InfoPC cidPC sid
In DepthDetails ArticlePubMed