BDBM356691 3-cyclopentyl-1-(3- (3,6-difluoro-9H- carbazol-9-yl)-2- hydroxypropyl) piperidin-2-one::US10214507, Compound 23::US10759777, Compound 23
SMILES OC(CN1CCCC(C2CCCC2)C1=O)Cn1c2ccc(F)cc2c2cc(F)ccc12
InChI Key InChIKey=ADPHDGYQCCCIQX-UHFFFAOYSA-N
Data  2 EC50
  Tab Delimited (TSV)   2D SDfile   Computed 3D by Vconf -m prep SDfile
Find this compound or compounds like it in BindingDB:
Activity Spreadsheet -- Enzyme Inhibition Constant Data from BindingDB
Found 2 hits for monomerid = 356691
TargetPeriod circadian protein homolog 2(Homo sapiens (Human))
Synchronicity Pharma
US Patent
LigandPNGBDBM356691(3-cyclopentyl-1-(3- (3,6-difluoro-9H- carbazol-9-y...)
Affinity DataEC50:  399nM. Assay description: In brief, stable U20S reporter cells harboring Per2-dLuc were plated at a density of 30,000 cells/well in Corning 96-well, solid white, flat bottom, ...
Ligand InfoPC cidPC sid
In DepthDetails US Patent
TargetPeriod circadian protein homolog 2(Homo sapiens (Human))
Synchronicity Pharma
US Patent
LigandPNGBDBM356691(3-cyclopentyl-1-(3- (3,6-difluoro-9H- carbazol-9-y...)
Affinity DataEC50:  399nM. Assay description: Compounds were screened by using a high-throughput circadian assay system as previously described in Zhang, E. E. et al. Cell, 2009, 139, 199-210. In...
Ligand InfoPC cidPC sid
In DepthDetails US Patent