BDBM356980 1-(3-(9H-carbazol- 9-yl)-2- hydroxypropyl)-3- methylpiperidin-2- one::US10214507, Compound 64::US10759777, Compound 64
SMILES CC1CCCN(CC(O)Cn2c3ccccc3c3ccccc23)C1=O
InChI Key InChIKey=TZYKYCVFIPVURD-UHFFFAOYSA-N
Data  2 EC50
  Tab Delimited (TSV)   2D SDfile   Computed 3D by Vconf -m prep SDfile
Find this compound or compounds like it in BindingDB:
Activity Spreadsheet -- Enzyme Inhibition Constant Data from BindingDB
Found 2 hits for monomerid = 356980
TargetPeriod circadian protein homolog 2(Homo sapiens (Human))
Synchronicity Pharma
US Patent
LigandPNGBDBM356980(1-(3-(9H-carbazol- 9-yl)-2- hydroxypropyl)-3- meth...)
Affinity DataEC50:  462nM. Assay description: In brief, stable U20S reporter cells harboring Per2-dLuc were plated at a density of 30,000 cells/well in Corning 96-well, solid white, flat bottom, ...
Ligand InfoPC cidPC sid
In DepthDetails US Patent
TargetPeriod circadian protein homolog 2(Homo sapiens (Human))
Synchronicity Pharma
US Patent
LigandPNGBDBM356980(1-(3-(9H-carbazol- 9-yl)-2- hydroxypropyl)-3- meth...)
Affinity DataEC50:  462nM. Assay description: Compounds were screened by using a high-throughput circadian assay system as previously described in Zhang, E. E. et al. Cell, 2009, 139, 199-210. In...
Ligand InfoPC cidPC sid
In DepthDetails US Patent