BDBM35770 cis-1,2-diaminocyclohexane derivative, 5k
SMILES CN(C)C(=O)[C@H]1CC[C@H](NC(=O)C2=Nc3ccc(Cl)cc3S(=O)(=O)N2)[C@@H](C1)NC(=O)c1nc2CCN(C)Cc2s1
InChI Key InChIKey=BPFHOVIJMQSTBH-DHSIGJKJSA-N
Data  1 IC50
  Tab Delimited (TSV)   2D SDfile   Computed 3D by Vconf -m prep SDfile
Find this compound or compounds like it in BindingDB:
Activity Spreadsheet -- Enzyme Inhibition Constant Data from BindingDB
Found 1 hit for monomerid = 35770
TargetCoagulation factor X(Homo sapiens (Human))
Daiichi Sankyo
LigandPNGBDBM35770(cis-1,2-diaminocyclohexane derivative, 5k)
Affinity DataIC50:  4.90nMpH: 7.4 T: 2°C. Assay description: The in vitro anti-fXa activity was measured by using a chromogenic substrate S-2222 and human fXa. Aqueous DMSO or test compounds in aqueous DMSO and...
Ligand InfoPC cidPC sid
In DepthDetails ArticlePubMed