BDBM357712 N-((3-(2,6-difluoro-3,5-dimethoxyphenyl)-1-(3-fluorobenzyl)-2-oxo-1,2,3,4-tetrahydropyrido[4,3-d]pyrimidin-7-yl)methyl)acrylamide::US10214528, Example 16::US10738048, Example 16::US11014923, Example 16::US11667635, Example 16::US9890156, Example 16
SMILES COc1cc(OC)c(F)c(N2Cc3cnc(CNC(=O)C=C)cc3N(Cc3cccc(F)c3)C2=O)c1F
InChI Key InChIKey=DQQVACSMEANERY-UHFFFAOYSA-N
Data  20 IC50
  Tab Delimited (TSV)   2D SDfile   Computed 3D by Vconf -m prep SDfile
Find this compound or compounds like it in BindingDB:
Activity Spreadsheet -- Enzyme Inhibition Constant Data from BindingDB
Found 20 hits for monomerid = 357712
TargetFibroblast growth factor receptor 1(Homo sapiens (Human))
Incyte
US Patent
LigandPNGBDBM357712(N-((3-(2,6-difluoro-3,5-dimethoxyphenyl)-1-(3-fluo...)
Affinity DataIC50:  115nM. Assay description: TBD
Ligand InfoPC cidPC sid
In DepthDetails US Patent
TargetFibroblast growth factor receptor 4(Homo sapiens (Human))
Incyte
US Patent
LigandPNGBDBM357712(N-((3-(2,6-difluoro-3,5-dimethoxyphenyl)-1-(3-fluo...)
Affinity DataIC50:  20nM. Assay description: The inhibitor potency of the exemplified compounds was measured in an enzyme assay that measures peptide phosphorylation using FRET measurements to d...
Ligand InfoPC cidPC sid
In DepthDetails US Patent
TargetFibroblast growth factor receptor 3(Homo sapiens (Human))
Incyte
US Patent
LigandPNGBDBM357712(N-((3-(2,6-difluoro-3,5-dimethoxyphenyl)-1-(3-fluo...)
Affinity DataIC50:  115nM. Assay description: TBD
Ligand InfoPC cidPC sid
In DepthDetails US Patent
TargetFibroblast growth factor receptor 4(Homo sapiens (Human))
Incyte
US Patent
LigandPNGBDBM357712(N-((3-(2,6-difluoro-3,5-dimethoxyphenyl)-1-(3-fluo...)
Affinity DataIC50:  20nM. Assay description: TBD
Ligand InfoPC cidPC sid
In DepthDetails US Patent
TargetFibroblast growth factor receptor 1(Homo sapiens (Human))
Incyte
US Patent
LigandPNGBDBM357712(N-((3-(2,6-difluoro-3,5-dimethoxyphenyl)-1-(3-fluo...)
Affinity DataIC50:  125nM. Assay description: The inhibitor potency of the exemplified compounds was measured in an enzyme assay that measures peptide phosphorylation using FRET measurements to d...
Ligand InfoPC cidPC sid
In DepthDetails US Patent
TargetFibroblast growth factor receptor 2(Homo sapiens (Human))
Incyte
US Patent
LigandPNGBDBM357712(N-((3-(2,6-difluoro-3,5-dimethoxyphenyl)-1-(3-fluo...)
Affinity DataIC50:  125nM. Assay description: The inhibitor potency of the exemplified compounds was measured in an enzyme assay that measures peptide phosphorylation using FRET measurements to d...
Ligand InfoPC cidPC sid
In DepthDetails US Patent
TargetFibroblast growth factor receptor 3(Homo sapiens (Human))
Incyte
US Patent
LigandPNGBDBM357712(N-((3-(2,6-difluoro-3,5-dimethoxyphenyl)-1-(3-fluo...)
Affinity DataIC50:  125nM. Assay description: The inhibitor potency of the exemplified compounds was measured in an enzyme assay that measures peptide phosphorylation using FRET measurements to d...
Ligand InfoPC cidPC sid
In DepthDetails US Patent
TargetFibroblast growth factor receptor 4(Homo sapiens (Human))
Incyte
US Patent
LigandPNGBDBM357712(N-((3-(2,6-difluoro-3,5-dimethoxyphenyl)-1-(3-fluo...)
Affinity DataIC50:  20nM. Assay description: The inhibitor potency of the exemplified compounds was measured in an enzyme assay that measures peptide phosphorylation using FRET measurements to d...
Ligand InfoPC cidPC sid
In DepthDetails US Patent
TargetFibroblast growth factor receptor 1(Homo sapiens (Human))
Incyte
US Patent
LigandPNGBDBM357712(N-((3-(2,6-difluoro-3,5-dimethoxyphenyl)-1-(3-fluo...)
Affinity DataIC50:  115nM. Assay description: The inhibitor potency of the exemplified compounds was measured in an enzyme assay that measures peptide phosphorylation using FRET measurements to d...
Ligand InfoPC cidPC sid
In DepthDetails US Patent
TargetFibroblast growth factor receptor 2(Homo sapiens (Human))
Incyte
US Patent
LigandPNGBDBM357712(N-((3-(2,6-difluoro-3,5-dimethoxyphenyl)-1-(3-fluo...)
Affinity DataIC50:  115nM. Assay description: The inhibitor potency of the exemplified compounds was measured in an enzyme assay that measures peptide phosphorylation using FRET measurements to d...
Ligand InfoPC cidPC sid
In DepthDetails US Patent
TargetFibroblast growth factor receptor 3(Homo sapiens (Human))
Incyte
US Patent
LigandPNGBDBM357712(N-((3-(2,6-difluoro-3,5-dimethoxyphenyl)-1-(3-fluo...)
Affinity DataIC50:  115nM. Assay description: The inhibitor potency of the exemplified compounds was measured in an enzyme assay that measures peptide phosphorylation using FRET measurements to d...
Ligand InfoPC cidPC sid
In DepthDetails US Patent
TargetFibroblast growth factor receptor 4(Homo sapiens (Human))
Incyte
US Patent
LigandPNGBDBM357712(N-((3-(2,6-difluoro-3,5-dimethoxyphenyl)-1-(3-fluo...)
Affinity DataIC50:  20nM. Assay description: The inhibitor potency of the exemplified compounds was measured in an enzyme assay that measures peptide phosphorylation using FRET measurements to d...
Ligand InfoPC cidPC sid
In DepthDetails US Patent
TargetFibroblast growth factor receptor 1(Homo sapiens (Human))
Incyte
US Patent
LigandPNGBDBM357712(N-((3-(2,6-difluoro-3,5-dimethoxyphenyl)-1-(3-fluo...)
Affinity DataIC50:  115nM. Assay description: The inhibitor potency of the exemplified compounds was measured in an enzyme assay that measures peptide phosphorylation using FRET measurements to d...
Ligand InfoPC cidPC sid
In DepthDetails US Patent
TargetFibroblast growth factor receptor 2(Homo sapiens (Human))
Incyte
US Patent
LigandPNGBDBM357712(N-((3-(2,6-difluoro-3,5-dimethoxyphenyl)-1-(3-fluo...)
Affinity DataIC50:  115nM. Assay description: The inhibitor potency of the exemplified compounds was measured in an enzyme assay that measures peptide phosphorylation using FRET measurements to d...
Ligand InfoPC cidPC sid
In DepthDetails US Patent
TargetFibroblast growth factor receptor 3(Homo sapiens (Human))
Incyte
US Patent
LigandPNGBDBM357712(N-((3-(2,6-difluoro-3,5-dimethoxyphenyl)-1-(3-fluo...)
Affinity DataIC50:  115nM. Assay description: The inhibitor potency of the exemplified compounds was measured in an enzyme assay that measures peptide phosphorylation using FRET measurements to d...
Ligand InfoPC cidPC sid
In DepthDetails US Patent
TargetFibroblast growth factor receptor 4(Homo sapiens (Human))
Incyte
US Patent
LigandPNGBDBM357712(N-((3-(2,6-difluoro-3,5-dimethoxyphenyl)-1-(3-fluo...)
Affinity DataIC50:  20nM. Assay description: The inhibitor potency of the exemplified compounds was measured in an enzyme assay that measures peptide phosphorylation using FRET measurements to d...
Ligand InfoPC cidPC sid
In DepthDetails US Patent
TargetFibroblast growth factor receptor 1(Homo sapiens (Human))
Incyte
US Patent
LigandPNGBDBM357712(N-((3-(2,6-difluoro-3,5-dimethoxyphenyl)-1-(3-fluo...)
Affinity DataIC50:  115nM. Assay description: The inhibitor potency of the exemplified compounds was measured in an enzyme assay that measures peptide phosphorylation using FRET measurements to d...
Ligand InfoPC cidPC sid
In DepthDetails US Patent
TargetFibroblast growth factor receptor 2(Homo sapiens (Human))
Incyte
US Patent
LigandPNGBDBM357712(N-((3-(2,6-difluoro-3,5-dimethoxyphenyl)-1-(3-fluo...)
Affinity DataIC50:  115nM. Assay description: The inhibitor potency of the exemplified compounds was measured in an enzyme assay that measures peptide phosphorylation using FRET measurements to d...
Ligand InfoPC cidPC sid
In DepthDetails US Patent
TargetFibroblast growth factor receptor 3(Homo sapiens (Human))
Incyte
US Patent
LigandPNGBDBM357712(N-((3-(2,6-difluoro-3,5-dimethoxyphenyl)-1-(3-fluo...)
Affinity DataIC50:  115nM. Assay description: The inhibitor potency of the exemplified compounds was measured in an enzyme assay that measures peptide phosphorylation using FRET measurements to d...
Ligand InfoPC cidPC sid
In DepthDetails US Patent
TargetFibroblast growth factor receptor 2(Homo sapiens (Human))
Incyte
US Patent
LigandPNGBDBM357712(N-((3-(2,6-difluoro-3,5-dimethoxyphenyl)-1-(3-fluo...)
Affinity DataIC50:  115nM. Assay description: TBD
Ligand InfoPC cidPC sid
In DepthDetails US Patent