BDBM357753 KM-05-174/(I-205)::US10214530, Example 22
SMILES CCn1c2nc(Cc3nc4cc(F)c(cc4[nH]3)N3CCOCC3)n(Cc3ccccc3)c2c(=O)[nH]c1=O
InChI Key InChIKey=MCAYBYDMBYIYAE-UHFFFAOYSA-N
Data  2 IC50
  Tab Delimited (TSV)   2D SDfile   Computed 3D by Vconf -m prep SDfile
Find this compound or compounds like it in BindingDB:
Activity Spreadsheet -- Enzyme Inhibition Constant Data from BindingDB
Found 2 hits for monomerid = 357753
TargetTryptophan 5-hydroxylase 2(Homo sapiens (Human))
Max-DelbrÜCk-Centrum FÜR Molekulare Medizin
US Patent
LigandPNGBDBM357753(KM-05-174/(I-205) | US10214530, Example 22)
Affinity DataIC50:  60nM. Assay description: These compounds according to the afore-mentioned examples were tested for tryptophan hydroxylase (TPH) inhibitory activity in a fluorescence-based in...
Ligand InfoPC cidPC sid
In DepthDetails US Patent
TargetTryptophan 5-hydroxylase 1(Homo sapiens (Human))
Max-DelbrÜCk-Centrum FÜR Molekulare Medizin
US Patent
LigandPNGBDBM357753(KM-05-174/(I-205) | US10214530, Example 22)
Affinity DataIC50:  1.96E+3nM. Assay description: These compounds according to the afore-mentioned examples were tested for tryptophan hydroxylase (TPH) inhibitory activity in a fluorescence-based in...
Ligand InfoPC cidPC sid
In DepthDetails US Patent