BDBM357823 US10214534, Compound 2005
SMILES CNC(=O)c1c(oc2nc(CCC(F)(F)F)c(cc12)-c1cccc(c1)C(=O)NC(C)(C)C)-c1ccc(Oc2cccc(F)c2)cc1
InChI Key InChIKey=LSSWFZZXJMDYLN-UHFFFAOYSA-N
Data  1 EC50
  Tab Delimited (TSV)   2D SDfile   Computed 3D by Vconf -m prep SDfile
Find this compound or compounds like it in BindingDB:
Activity Spreadsheet -- Enzyme Inhibition Constant Data from BindingDB
Found 1 hit for monomerid = 357823
TargetGenome polyprotein(Hepatitis C Virus (Virus))
Bristol-Myers Squibb
US Patent
LigandPNGBDBM357823(US10214534, Compound 2005)
Affinity DataEC50: <100nM. Assay description: To evaluate compound efficacy, titrated compounds were transferred to sterile 384-well tissue culture treated plates, and the plates were seeded with...
Ligand InfoPC cidPC sid
In DepthDetails US Patent