BDBM357887 US10214536, Compound 61
SMILES Nc1nc2oc3ccc(cc3c(=O)c2cc1C(O)=O)C1=CCC(F)(F)CC1
InChI Key InChIKey=BVONOGZFUWUGHS-UHFFFAOYSA-N
Data  1 IC50
  Tab Delimited (TSV)   2D SDfile   Computed 3D by Vconf -m prep SDfile
Find this compound or compounds like it in BindingDB:
Activity Spreadsheet -- Enzyme Inhibition Constant Data from BindingDB
Found 1 hit for monomerid = 357887
TargetSerine/threonine-protein kinase TBK1(Homo sapiens (Human))
The Regents Of The University Of Michigan
US Patent
LigandPNGBDBM357887(US10214536, Compound 61)
Affinity DataIC50:  1.17E+3nM. Assay description: Kinase assays are commonly used for determining the ability of a small molecule to inhibit enzyme activity. By measuring the degree of phosphorylatio...
Ligand InfoPC cidPC sid
In DepthDetails US Patent