BDBM357892 US10214536, Compound 71
SMILES NNC(=N)c1cc2c(nc1N)oc1ccc(cc1c2=O)C1CCCCC1
InChI Key InChIKey=PSVKQXPKQMLVID-UHFFFAOYSA-N
Data  1 IC50
  Tab Delimited (TSV)   2D SDfile   Computed 3D by Vconf -m prep SDfile
Find this compound or compounds like it in BindingDB:
Activity Spreadsheet -- Enzyme Inhibition Constant Data from BindingDB
Found 1 hit for monomerid = 357892
TargetSerine/threonine-protein kinase TBK1(Homo sapiens (Human))
The Regents Of The University Of Michigan
US Patent
LigandPNGBDBM357892(US10214536, Compound 71)
Affinity DataIC50:  600nM. Assay description: Kinase assays are commonly used for determining the ability of a small molecule to inhibit enzyme activity. By measuring the degree of phosphorylatio...
Ligand InfoPC cidPC sid
In DepthDetails US Patent