BDBM357912 Ethyl 2-amino-8-fluoro-5-oxo-7-(prop-1-en-2-yl)-5H-chromeno[2,3-b]pyridine-3-carboxylate::US10214536, Compound 266b
SMILES CCOC(=O)c1cc2c(nc1N)oc1cc(F)c(cc1c2=O)C(C)=C
InChI Key InChIKey=UZVAQQIDIWCAFV-UHFFFAOYSA-N
Data  1 IC50
  Tab Delimited (TSV)   2D SDfile   Computed 3D by Vconf -m prep SDfile
Find this compound or compounds like it in BindingDB:
Activity Spreadsheet -- Enzyme Inhibition Constant Data from BindingDB
Found 1 hit for monomerid = 357912
TargetSerine/threonine-protein kinase TBK1(Homo sapiens (Human))
The Regents Of The University Of Michigan
US Patent
LigandPNGBDBM357912(Ethyl 2-amino-8-fluoro-5-oxo-7-(prop-1-en-2-yl)-5H...)
Affinity DataIC50:  2.16E+3nM. Assay description: Kinase assays are commonly used for determining the ability of a small molecule to inhibit enzyme activity. By measuring the degree of phosphorylatio...
Ligand InfoPC cidPC sid
In DepthDetails US Patent