BDBM35806 pyrimidine-4-carboxamide, 62
SMILES Cc1cccnc1CNC(=O)c1cc(nc(N)n1)-c1cccc(F)c1
InChI Key InChIKey=ZHVWEQPYUMWWRM-UHFFFAOYSA-N
Data  2 KI
  Tab Delimited (TSV)   2D SDfile   Computed 3D by Vconf -m prep SDfile
Find this compound or compounds like it in BindingDB:
Activity Spreadsheet -- Enzyme Inhibition Constant Data from BindingDB
Found 2 hits for monomerid = 35806
TargetAdenosine receptor A2a(Homo sapiens (Human))
Vernalis (R&D)
LigandPNGBDBM35806(pyrimidine-4-carboxamide, 62)
Affinity DataKi:  9nM. Assay description: Binding assays were performed in a total volume of 250 uL, containing radioligand, membranes and test compounds. Following 60 (A2B, A3) or 90 (A1, A2...
In DepthDetails ArticlePubMed
TargetAdenosine receptor A1(Homo sapiens (Human))
Vernalis (R&D)
LigandPNGBDBM35806(pyrimidine-4-carboxamide, 62)
Affinity DataKi:  31nM. Assay description: Binding assays were performed in a total volume of 250 uL, containing radioligand, membranes and test compounds. Following 60 (A2B, A3) or 90 (A1, A2...
In DepthDetails ArticlePubMed