BDBM35821 pyrimidine-4-carboxamide, 93
SMILES CCc1c(nc(N)nc1-c1ccc(C)o1)C(=O)NCc1ccccn1
InChI Key InChIKey=HZJBTXVDTJIKKZ-UHFFFAOYSA-N
Data  2 KI
  Tab Delimited (TSV)   2D SDfile   Computed 3D by Vconf -m prep SDfile
Find this compound or compounds like it in BindingDB:
Activity Spreadsheet -- Enzyme Inhibition Constant Data from BindingDB
Found 2 hits for monomerid = 35821
TargetAdenosine receptor A2a(Homo sapiens (Human))
Vernalis (R&D)
LigandPNGBDBM35821(pyrimidine-4-carboxamide, 93)
Affinity DataKi:  25nM. Assay description: Binding assays were performed in a total volume of 250 uL, containing radioligand, membranes and test compounds. Following 60 (A2B, A3) or 90 (A1, A2...
In DepthDetails ArticlePubMed
TargetAdenosine receptor A1(Homo sapiens (Human))
Vernalis (R&D)
LigandPNGBDBM35821(pyrimidine-4-carboxamide, 93)
Affinity DataKi:  435nM. Assay description: Binding assays were performed in a total volume of 250 uL, containing radioligand, membranes and test compounds. Following 60 (A2B, A3) or 90 (A1, A2...
In DepthDetails ArticlePubMed