BDBM35855 acrylic acid derivative, 4
SMILES OC(=O)\C=C\c1ccc(Cn2cccn2)cc1OCCc1ccc2ccccc2c1
InChI Key InChIKey=BAXFMLZOUPMNQW-ZHACJKMWSA-N
Data  4 KI  1 EC50
  Tab Delimited (TSV)   2D SDfile   Computed 3D by Vconf -m prep SDfile
Find this compound or compounds like it in BindingDB:
Activity Spreadsheet -- Enzyme Inhibition Constant Data from BindingDB
Found 4 hits for monomerid = 35855
TargetProstaglandin E2 receptor EP3 subtype(Mus musculus (Mouse))
Ono Pharmaceutical
LigandPNGBDBM35855(acrylic acid derivative, 4)
Affinity DataKi:  12nM EC50:  73nM. Assay description: Competitive binding studies were conducted using radiolabeled ligands and membrane fractions prepared from Chinese hamster ovary (CHO) cells stably e...
In DepthDetails ArticlePubMed
TargetProstaglandin E2 receptor EP4 subtype(Mus musculus (Mouse))
Ono Pharmaceutical
LigandPNGBDBM35855(acrylic acid derivative, 4)
Affinity DataKi:  670nM. Assay description: Competitive binding studies were conducted using radiolabeled ligands and membrane fractions prepared from Chinese hamster ovary (CHO) cells stably e...
In DepthDetails ArticlePubMed
TargetProstaglandin E2 receptor EP1 subtype(Mus musculus (Mouse))
Ono Pharmaceutical
LigandPNGBDBM35855(acrylic acid derivative, 4)
Affinity DataKi:  2.90E+3nM ΔG°:  -7.55kcal/molepH: 6.0 T: 2°C. Assay description: Competitive binding studies were conducted using radiolabeled ligands and membrane fractions prepared from Chinese hamster ovary (CHO) cells stably e...
In DepthDetails ArticlePubMed
TargetProstaglandin E2 receptor EP2 subtype(Mus musculus (Mouse))
Ono Pharmaceutical
LigandPNGBDBM35855(acrylic acid derivative, 4)
Affinity DataKi:  3.30E+3nM ΔG°:  -7.47kcal/molepH: 6.0 T: 2°C. Assay description: Competitive binding studies were conducted using radiolabeled ligands and membrane fractions prepared from Chinese hamster ovary (CHO) cells stably e...
In DepthDetails ArticlePubMed