BDBM358611 (S)-2-(4-acetyl-3-ethyl-3-methyl-2- oxopiperazin-1-yl)-4-(4-amino-5- chloropyrrolo[2,1-f][1,2,4]triazin-7- yl)benzonitrile::US10214537, Example 688::US10214537, Example 689
SMILES CC[C@]1(C)N(CCN(C1=O)c1cc(ccc1C#N)-c1cc(Cl)c2c(N)ncnn12)C(C)=O
InChI Key InChIKey=VVCMBCOHWGFSHN-QFIPXVFZSA-N
Data  2 IC50
  Tab Delimited (TSV)   2D SDfile   Computed 3D by Vconf -m prep SDfile
Find this compound or compounds like it in BindingDB:
Activity Spreadsheet -- Enzyme Inhibition Constant Data from BindingDB
Found 2 hits for monomerid = 358611
TargetPhosphatidylinositol 4,5-bisphosphate 3-kinase catalytic subunit delta isoform(Homo sapiens (Human))
Bristol-Myers Squibb
US Patent
LigandPNGBDBM358611((S)-2-(4-acetyl-3-ethyl-3-methyl-2- oxopiperazin-1...)
Affinity DataIC50:  0.900nM. Assay description: The ADP-Glo format PI3K assays were performed in Proxiplate 384-well plates (Perkin Elmer #6008280). The final assay volume was 2 μl prepared fr...
Ligand InfoPC cidPC sid
In DepthDetails US Patent
TargetPhosphatidylinositol 4,5-bisphosphate 3-kinase catalytic subunit delta isoform(Homo sapiens (Human))
Bristol-Myers Squibb
US Patent
LigandPNGBDBM358611((S)-2-(4-acetyl-3-ethyl-3-methyl-2- oxopiperazin-1...)
Affinity DataIC50:  0.5nM. Assay description: The ADP-Glo format PI3K assays were performed in Proxiplate 384-well plates (Perkin Elmer #6008280). The final assay volume was 2 μl prepared fr...
Ligand InfoPC cidPC sid
In DepthDetails US Patent