BDBM35871 5,6-di-p-tolyl-pyrazine-2-carboxylic acid piperidin-1-ylamide::5,6-diaryl-pyrazine-2-amide derivative, 5c::CHEMBL226223::N-(piperidin-1-yl)-5,6-dip-tolylpyrazine-2-carboxamide
SMILES Cc1ccc(cc1)-c1ncc(nc1-c1ccc(C)cc1)C(=O)NN1CCCCC1
InChI Key InChIKey=CLAIXBYIEGGFDP-UHFFFAOYSA-N
Data  1 KI  2 IC50
  Tab Delimited (TSV)   2D SDfile   Computed 3D by Vconf -m prep SDfile
Find this compound or compounds like it in BindingDB:
Activity Spreadsheet -- Enzyme Inhibition Constant Data from BindingDB
Found 3 hits for monomerid = 35871
TargetCannabinoid receptor 1(Homo sapiens (Human))
Pharmaceutical Research Institute
Curated by ChEMBL
LigandPNGBDBM35871(5,6-di-p-tolyl-pyrazine-2-carboxylic acid piperidi...)
Affinity DataKi:  53nM. Assay description: Binding affinity to human CB1 receptor
In DepthDetails ArticlePubMed
TargetCannabinoid receptor 1(Homo sapiens (Human))
Pharmaceutical Research Institute
Curated by ChEMBL
LigandPNGBDBM35871(5,6-di-p-tolyl-pyrazine-2-carboxylic acid piperidi...)
Affinity DataIC50:  12.0nM. Assay description: Antagonist activity against human recombinant cannabinoid-1 receptor
In DepthDetails ArticlePubMed
TargetCannabinoid receptor 1(Homo sapiens (Human))
Pharmaceutical Research Institute
Curated by ChEMBL
LigandPNGBDBM35871(5,6-di-p-tolyl-pyrazine-2-carboxylic acid piperidi...)
Affinity DataIC50:  6nMpH: 7.4 T: 2°C. Assay description: A GTP-gamma-S CB1 functional assay was used to assess the potency of the pyrazine derivatives. [35S]GTP-gamma-S binding assays were performed at 30 d...
In DepthDetails ArticlePubMed