BDBM358764 US10214544, Example 69
SMILES COc1nn2cc(nc2s1)-c1cc2c(OCc3cccc(NC(=O)c4ccnnc4)c3)cc(OC)cc2o1
InChI Key InChIKey=NRKYXHFCPYRJOG-UHFFFAOYSA-N
Data  1 EC50
  Tab Delimited (TSV)   2D SDfile   Computed 3D by Vconf -m prep SDfile
Find this compound or compounds like it in BindingDB:
Activity Spreadsheet -- Enzyme Inhibition Constant Data from BindingDB
Found 1 hit for monomerid = 358764
TargetProteinase-activated receptor 4(Homo sapiens (Human))
Universite De Montreal
US Patent
LigandPNGBDBM358764(US10214544, Example 69)
Affinity DataEC50:  12nM. Assay description: FLIPR-based calcium mobilization assay in HEK293 cells was used to measure PAR4 antagonism, agonism, and selectivity against PAR1. The activity of th...
Ligand InfoPC cidPC sid
In DepthDetails US Patent