BDBM358842 US10214544, Example 157
SMILES COc1nn2cc(nc2s1)-c1cc2c(OCc3cccc(NC(=O)c4ccc(OC)c(c4)C(F)(F)F)c3)cc(OC)cc2o1
InChI Key InChIKey=HYUQYCBXWWPANI-UHFFFAOYSA-N
Data  1 EC50
  Tab Delimited (TSV)   2D SDfile   Computed 3D by Vconf -m prep SDfile
Find this compound or compounds like it in BindingDB:
Activity Spreadsheet -- Enzyme Inhibition Constant Data from BindingDB
Found 1 hit for monomerid = 358842
TargetProteinase-activated receptor 4(Homo sapiens (Human))
Universite De Montreal
US Patent
LigandPNGBDBM358842(US10214544, Example 157)
Affinity DataEC50:  2.80nM. Assay description: FLIPR-based calcium mobilization assay in HEK293 cells was used to measure PAR4 antagonism, agonism, and selectivity against PAR1. The activity of th...
Ligand InfoPC cidPC sid
In DepthDetails US Patent