BDBM359112 US10220048, Compound AA22::US10952992, No. AA22::US11413242, Compound AA22::US11666558, Example AA22
SMILES COC(=O)N[C@@H](Cc1ccccc1)C(=O)N[C@@H](Cc1ccc(NS(O)(=O)=O)cc1)c1nc(cs1)-c1cccs1
InChI Key InChIKey=GGWMINFKGVMFIT-SFTDATJTSA-N
Data  4 IC50
  Tab Delimited (TSV)   2D SDfile   Computed 3D by Vconf -m prep SDfile
Find this compound or compounds like it in BindingDB:
Activity Spreadsheet -- Enzyme Inhibition Constant Data from BindingDB
Found 4 hits for monomerid = 359112
TargetReceptor-type tyrosine-protein phosphatase beta(Homo sapiens (Human))
Aerpio Therapeutics
US Patent
LigandPNGBDBM359112(US10220048, Compound AA22 | US10952992, No. AA22 |...)
Affinity DataIC50: <5nM. Assay description: HPTP-β inhibition can be tested by any method chosen by the formulator, for example, Amarasinge K. K. et al., “Design and Synthesis of Potent, N...
Ligand InfoKEGGPC cidPC sid
In DepthDetails US Patent
TargetReceptor-type tyrosine-protein phosphatase beta(Homo sapiens (Human))
Aerpio Therapeutics
US Patent
LigandPNGBDBM359112(US10220048, Compound AA22 | US10952992, No. AA22 |...)
Affinity DataIC50:  50nM. Assay description: Non-limiting examples of the HPTP-β IC50(μM) activity for illustrative compounds are listed in TABLE 2.
Ligand InfoKEGGPC cidPC sid
In DepthDetails US Patent
TargetReceptor-type tyrosine-protein phosphatase beta(Homo sapiens (Human))
Aerpio Therapeutics
US Patent
LigandPNGBDBM359112(US10220048, Compound AA22 | US10952992, No. AA22 |...)
Affinity DataIC50: <9.00E+3nM. Assay description: Non-limiting examples of the HPTPβ IC50 (μM) activity.
Ligand InfoKEGGPC cidPC sid
In DepthDetails US Patent
TargetReceptor-type tyrosine-protein phosphatase beta(Homo sapiens (Human))
Aerpio Therapeutics
US Patent
LigandPNGBDBM359112(US10220048, Compound AA22 | US10952992, No. AA22 |...)
Affinity DataIC50: <50nM. Assay description: Non-limiting examples of the HPTP-β IC50 (μM) activity.
Ligand InfoKEGGPC cidPC sid
In DepthDetails US Patent