BDBM359168 US10220048, Compound AA78::US10952992, No. AA78::US11413242, Compound AA78::US11666558, Example AA78
SMILES CCc1csc(n1)[C@H](Cc1ccc(NS(O)(=O)=O)cc1)NC(=O)Cc1cccc(F)c1F
InChI Key InChIKey=OYRLZGKRUDDGED-SFHVURJKSA-N
Data  4 IC50
  Tab Delimited (TSV)   2D SDfile   Computed 3D by Vconf -m prep SDfile
Find this compound or compounds like it in BindingDB:
Activity Spreadsheet -- Enzyme Inhibition Constant Data from BindingDB
Found 4 hits for monomerid = 359168
TargetReceptor-type tyrosine-protein phosphatase beta(Homo sapiens (Human))
Aerpio Therapeutics
US Patent
LigandPNGBDBM359168(US10220048, Compound AA78 | US10952992, No. AA78 |...)
Affinity DataIC50:  28nM. Assay description: HPTP-β inhibition can be tested by any method chosen by the formulator, for example, Amarasinge K. K. et al., “Design and Synthesis of Potent, N...
Ligand InfoKEGGPC cidPC sid
In DepthDetails US Patent
TargetReceptor-type tyrosine-protein phosphatase beta(Homo sapiens (Human))
Aerpio Therapeutics
US Patent
LigandPNGBDBM359168(US10220048, Compound AA78 | US10952992, No. AA78 |...)
Affinity DataIC50:  28nM. Assay description: Non-limiting examples of the HPTP-β IC50(μM) activity for illustrative compounds are listed in TABLE 2.
Ligand InfoKEGGPC cidPC sid
In DepthDetails US Patent
TargetReceptor-type tyrosine-protein phosphatase beta(Homo sapiens (Human))
Aerpio Therapeutics
US Patent
LigandPNGBDBM359168(US10220048, Compound AA78 | US10952992, No. AA78 |...)
Affinity DataIC50:  28nM. Assay description: Non-limiting examples of the HPTPβ IC50 (μM) activity.
Ligand InfoKEGGPC cidPC sid
In DepthDetails US Patent
TargetReceptor-type tyrosine-protein phosphatase beta(Homo sapiens (Human))
Aerpio Therapeutics
US Patent
LigandPNGBDBM359168(US10220048, Compound AA78 | US10952992, No. AA78 |...)
Affinity DataIC50:  28nM. Assay description: Non-limiting examples of the HPTP-β IC50 (μM) activity.
Ligand InfoKEGGPC cidPC sid
In DepthDetails US Patent