BDBM359533 US10221142, Example 20A
SMILES OC(=O)c1ccc(-c2nn(C(=O)c3c(Cl)cccc3C3(CC3)C(F)(F)F)c3CNCCc23)c(F)c1
InChI Key InChIKey=UMLSSXQLTBKGOA-UHFFFAOYSA-N
Data  1 IC50
  Tab Delimited (TSV)   2D SDfile   Computed 3D by Vconf -m prep SDfile
Find this compound or compounds like it in BindingDB:
Activity Spreadsheet -- Enzyme Inhibition Constant Data from BindingDB
Found 1 hit for monomerid = 359533
TargetNuclear receptor ROR-gamma(Homo sapiens (Human))
Merck Sharp & Dohme
US Patent
LigandPNGBDBM359533(US10221142, Example 20A)
Affinity DataIC50:  21nM. Assay description: The compounds of the invention inhibit RORgammaT activity. Activation of RORgammaT activity can be measured using, e.g., biochemical TR-FRET assay. I...
Ligand InfoPC cidPC sid
In DepthDetails US Patent