BDBM359608 US10221156, Example 1
SMILES CN1CCN(CCOc2ccc(cc2)-c2c(C)nc(C)c([C@H](OC(C)(C)C)C(O)=O)c2N2CCC(C)(C)CC2)CC1
InChI Key InChIKey=PROJDYHZKMWZDW-PMERELPUSA-N
Data  1 EC50
  Tab Delimited (TSV)   2D SDfile   Computed 3D by Vconf -m prep SDfile
Find this compound or compounds like it in BindingDB:
Activity Spreadsheet -- Enzyme Inhibition Constant Data from BindingDB
Found 1 hit for monomerid = 359608
TargetEnvelope glycoprotein gp160(Human immunodeficiency virus type 1 (isolate BRU/L...)
Viiv Healthcare UK (NO.5)
US Patent
LigandPNGBDBM359608(US10221156, Example 1)
Affinity DataEC50:  117nM. Assay description: A recombinant NL-RLuc proviral clone was constructed in which a section of the nef gene from NL4-3 was replaced with the Renilla Luciferase gene. Thi...
Ligand InfoPC cidPC sid
In DepthDetails US Patent