BDBM359624 N-[(1-Aminoisoquinolin-6-yl)methyl]-6-[(2-methylquinolin-6-yl)methyl]pyrazine-2-carboxamide::US10221161, Example 10::US11242333, Example 10
SMILES Cc1ccc2cc(Cc3cncc(n3)C(=O)NCc3ccc4c(N)nccc4c3)ccc2n1
InChI Key InChIKey=CGNIOLXFEPYYHB-UHFFFAOYSA-N
Data  4 IC50
  Tab Delimited (TSV)   2D SDfile   Computed 3D by Vconf -m prep SDfile
Find this compound or compounds like it in BindingDB:
Activity Spreadsheet -- Enzyme Inhibition Constant Data from BindingDB
Found 4 hits for monomerid = 359624
TargetPlasma kallikrein(Homo sapiens (Human))
Kalvista Pharmaceuticals
US Patent
LigandPNGBDBM359624(N-[(1-Aminoisoquinolin-6-yl)methyl]-6-[(2-methylqu...)
Affinity DataIC50:  194nM. Assay description: Plasma kallikrein inhibitory activity in vitro was determined using standard published methods (see e.g. Johansen et al., Int. J. Tiss. Reac. 1986, 8...
Ligand InfoPC cidPC sid
In DepthDetails US Patent
TargetKallikrein-1(Homo sapiens (Human))
Kalvista Pharmaceuticals
US Patent
LigandPNGBDBM359624(N-[(1-Aminoisoquinolin-6-yl)methyl]-6-[(2-methylqu...)
Affinity DataIC50:  3.02E+3nM. Assay description: KLK1 inhibitory activity in vitro was determined using standard published methods (see e.g. Johansen et al., Int. J. Tiss. Reac. 1986, 8, 185; Shori ...
Ligand InfoPC cidPC sid
In DepthDetails US Patent
TargetPlasma kallikrein(Homo sapiens (Human))
Kalvista Pharmaceuticals
US Patent
LigandPNGBDBM359624(N-[(1-Aminoisoquinolin-6-yl)methyl]-6-[(2-methylqu...)
Affinity DataIC50:  194nM. Assay description: Plasma kallikrein inhibitory activity in vitro was determined using standard published methods (see e.g. Johansen et al., Int. J. Tiss. Reac. 1986, 8...
Ligand InfoPC cidPC sid
In DepthDetails US Patent
TargetKallikrein-1(Homo sapiens (Human))
Kalvista Pharmaceuticals
US Patent
LigandPNGBDBM359624(N-[(1-Aminoisoquinolin-6-yl)methyl]-6-[(2-methylqu...)
Affinity DataIC50:  3.02E+3nM. Assay description: KLK1 inhibitory activity in vitro was determined using standard published methods (see e.g. Johansen et al., Int. J. Tiss. Reac. 1986, 8, 185; Shori ...
Ligand InfoPC cidPC sid
In DepthDetails US Patent