BDBM359648 N-[(1-Aminoisoquinolin-6-yl)methyl]-5-({3-methoxy-4-[(4-methylpyrazol-1-yl)methyl]phenyl}methyl)pyridine-3-carboxamide::US10221161, Example 33::US11242333, Example 33
SMILES COc1cc(Cc2cncc(c2)C(=O)NCc2ccc3c(N)nccc3c2)ccc1Cn1cc(C)cn1
InChI Key InChIKey=GTAQUAIETWGMKZ-UHFFFAOYSA-N
Data  4 IC50
  Tab Delimited (TSV)   2D SDfile   Computed 3D by Vconf -m prep SDfile
Find this compound or compounds like it in BindingDB:
Activity Spreadsheet -- Enzyme Inhibition Constant Data from BindingDB
Found 4 hits for monomerid = 359648
TargetPlasma kallikrein(Homo sapiens (Human))
Kalvista Pharmaceuticals
US Patent
LigandPNGBDBM359648(N-[(1-Aminoisoquinolin-6-yl)methyl]-5-({3-methoxy-...)
Affinity DataIC50:  17.1nM. Assay description: Plasma kallikrein inhibitory activity in vitro was determined using standard published methods (see e.g. Johansen et al., Int. J. Tiss. Reac. 1986, 8...
Ligand InfoPC cidPC sid
In DepthDetails US Patent
TargetKallikrein-1(Homo sapiens (Human))
Kalvista Pharmaceuticals
US Patent
LigandPNGBDBM359648(N-[(1-Aminoisoquinolin-6-yl)methyl]-5-({3-methoxy-...)
Affinity DataIC50:  1.71E+4nM. Assay description: KLK1 inhibitory activity in vitro was determined using standard published methods (see e.g. Johansen et al., Int. J. Tiss. Reac. 1986, 8, 185; Shori ...
Ligand InfoPC cidPC sid
In DepthDetails US Patent
TargetPlasma kallikrein(Homo sapiens (Human))
Kalvista Pharmaceuticals
US Patent
LigandPNGBDBM359648(N-[(1-Aminoisoquinolin-6-yl)methyl]-5-({3-methoxy-...)
Affinity DataIC50:  17.1nM. Assay description: Plasma kallikrein inhibitory activity in vitro was determined using standard published methods (see e.g. Johansen et al., Int. J. Tiss. Reac. 1986, 8...
Ligand InfoPC cidPC sid
In DepthDetails US Patent
TargetKallikrein-1(Homo sapiens (Human))
Kalvista Pharmaceuticals
US Patent
LigandPNGBDBM359648(N-[(1-Aminoisoquinolin-6-yl)methyl]-5-({3-methoxy-...)
Affinity DataIC50:  1.71E+4nM. Assay description: KLK1 inhibitory activity in vitro was determined using standard published methods (see e.g. Johansen et al., Int. J. Tiss. Reac. 1986, 8, 185; Shori ...
Ligand InfoPC cidPC sid
In DepthDetails US Patent