BDBM359661 N-[(1-Aminoisoquinolin-6-yl)methyl]-5-({4-[(3-fluorophenyl)methyl]piperazin-1-yl}methyl)pyridine-3-carboxamide::US10221161, Example 46::US11242333, Example 46
SMILES Nc1nccc2cc(CNC(=O)c3cncc(CN4CCN(Cc5cccc(F)c5)CC4)c3)ccc12
InChI Key InChIKey=JRLYQLXPWIQWEU-UHFFFAOYSA-N
Data  4 IC50
  Tab Delimited (TSV)   2D SDfile   Computed 3D by Vconf -m prep SDfile
Find this compound or compounds like it in BindingDB:
Activity Spreadsheet -- Enzyme Inhibition Constant Data from BindingDB
Found 4 hits for monomerid = 359661
TargetPlasma kallikrein(Homo sapiens (Human))
Kalvista Pharmaceuticals
US Patent
LigandPNGBDBM359661(N-[(1-Aminoisoquinolin-6-yl)methyl]-5-({4-[(3-fluo...)
Affinity DataIC50:  7.51E+3nM. Assay description: Plasma kallikrein inhibitory activity in vitro was determined using standard published methods (see e.g. Johansen et al., Int. J. Tiss. Reac. 1986, 8...
Ligand InfoPC cidPC sid
In DepthDetails US Patent
TargetPlasma kallikrein(Homo sapiens (Human))
Kalvista Pharmaceuticals
US Patent
LigandPNGBDBM359661(N-[(1-Aminoisoquinolin-6-yl)methyl]-5-({4-[(3-fluo...)
Affinity DataIC50:  7.51E+3nM. Assay description: Plasma kallikrein inhibitory activity in vitro was determined using standard published methods (see e.g. Johansen et al., Int. J. Tiss. Reac. 1986, 8...
Ligand InfoPC cidPC sid
In DepthDetails US Patent
TargetKallikrein-1(Homo sapiens (Human))
Kalvista Pharmaceuticals
US Patent
LigandPNGBDBM359661(N-[(1-Aminoisoquinolin-6-yl)methyl]-5-({4-[(3-fluo...)
Affinity DataIC50:  2.92E+4nM. Assay description: KLK1 inhibitory activity in vitro was determined using standard published methods (see e.g. Johansen et al., Int. J. Tiss. Reac. 1986, 8, 185; Shori ...
Ligand InfoPC cidPC sid
In DepthDetails US Patent
TargetKallikrein-1(Homo sapiens (Human))
Kalvista Pharmaceuticals
US Patent
LigandPNGBDBM359661(N-[(1-Aminoisoquinolin-6-yl)methyl]-5-({4-[(3-fluo...)
Affinity DataIC50:  2.92E+4nM. Assay description: KLK1 inhibitory activity in vitro was determined using standard published methods (see e.g. Johansen et al., Int. J. Tiss. Reac. 1986, 8, 185; Shori ...
Ligand InfoPC cidPC sid
In DepthDetails US Patent