BDBM359681 N-[(1-Aminoisoquinolin-6-yl)methyl]-5-{[6-(diethylamino)pyridin-3-yl]methyl}pyridine-3-carboxamide::US10221161, Example 66
SMILES CCN(CC)c1ccc(Cc2cncc(c2)C(=O)NCc2ccc3c(N)nccc3c2)cn1
InChI Key InChIKey=RRHDPDBRJHCVGS-UHFFFAOYSA-N
Data  2 IC50
  Tab Delimited (TSV)   2D SDfile   Computed 3D by Vconf -m prep SDfile
Find this compound or compounds like it in BindingDB:
Activity Spreadsheet -- Enzyme Inhibition Constant Data from BindingDB
Found 2 hits for monomerid = 359681
TargetKallikrein-1(Homo sapiens (Human))
Kalvista Pharmaceuticals
US Patent
LigandPNGBDBM359681(N-[(1-Aminoisoquinolin-6-yl)methyl]-5-{[6-(diethyl...)
Affinity DataIC50:  5.85E+3nM. Assay description: KLK1 inhibitory activity in vitro was determined using standard published methods (see e.g. Johansen et al., Int. J. Tiss. Reac. 1986, 8, 185; Shori ...
Ligand InfoPC cidPC sid
In DepthDetails US Patent
TargetPlasma kallikrein(Homo sapiens (Human))
Kalvista Pharmaceuticals
US Patent
LigandPNGBDBM359681(N-[(1-Aminoisoquinolin-6-yl)methyl]-5-{[6-(diethyl...)
Affinity DataIC50:  52.7nM. Assay description: Plasma kallikrein inhibitory activity in vitro was determined using standard published methods (see e.g. Johansen et al., Int. J. Tiss. Reac. 1986, 8...
Ligand InfoPC cidPC sid
In DepthDetails US Patent