BDBM359706 N-[(1-Aminoisoquinolin-6-yl)methyl]-5-{[2-(3-methoxypyrrolidin-1-yl)pyridin-4-yl]methyl}pyridine-3-carboxamide::US10221161, Example 88::US11242333, Example 92
SMILES COC1CCN(C1)c1cc(Cc2cncc(c2)C(=O)NCc2ccc3c(N)nccc3c2)ccn1
InChI Key InChIKey=AGESLAHMMMUCOA-UHFFFAOYSA-N
Data  6 IC50
  Tab Delimited (TSV)   2D SDfile   Computed 3D by Vconf -m prep SDfile
Find this compound or compounds like it in BindingDB:
Activity Spreadsheet -- Enzyme Inhibition Constant Data from BindingDB
Found 6 hits for monomerid = 359706
TargetPlasma kallikrein(Homo sapiens (Human))
Kalvista Pharmaceuticals
US Patent
LigandPNGBDBM359706(N-[(1-Aminoisoquinolin-6-yl)methyl]-5-{[2-(3-metho...)
Affinity DataIC50:  234nM. Assay description: Plasma kallikrein inhibitory activity in vitro was determined using standard published methods (see e.g. Johansen et al., Int. J. Tiss. Reac. 1986, 8...
Ligand InfoPC cidPC sid
In DepthDetails US Patent
TargetKallikrein-1(Homo sapiens (Human))
Kalvista Pharmaceuticals
US Patent
LigandPNGBDBM359706(N-[(1-Aminoisoquinolin-6-yl)methyl]-5-{[2-(3-metho...)
Affinity DataIC50:  9.85E+3nM. Assay description: KLK1 inhibitory activity in vitro was determined using standard published methods (see e.g. Johansen et al., Int. J. Tiss. Reac. 1986, 8, 185; Shori ...
Ligand InfoPC cidPC sid
In DepthDetails US Patent
TargetPlasma kallikrein(Homo sapiens (Human))
Kalvista Pharmaceuticals
US Patent
LigandPNGBDBM359706(N-[(1-Aminoisoquinolin-6-yl)methyl]-5-{[2-(3-metho...)
Affinity DataIC50:  355nM. Assay description: Plasma kallikrein inhibitory activity in vitro was determined using standard published methods (see e.g. Johansen et al., Int. J. Tiss. Reac. 1986, 8...
Ligand InfoPC cidPC sid
In DepthDetails US Patent
TargetKallikrein-1(Homo sapiens (Human))
Kalvista Pharmaceuticals
US Patent
LigandPNGBDBM359706(N-[(1-Aminoisoquinolin-6-yl)methyl]-5-{[2-(3-metho...)
Affinity DataIC50:  7.51E+3nM. Assay description: KLK1 inhibitory activity in vitro was determined using standard published methods (see e.g. Johansen et al., Int. J. Tiss. Reac. 1986, 8, 185; Shori ...
Ligand InfoPC cidPC sid
In DepthDetails US Patent
TargetPlasma kallikrein(Homo sapiens (Human))
Kalvista Pharmaceuticals
US Patent
LigandPNGBDBM359706(N-[(1-Aminoisoquinolin-6-yl)methyl]-5-{[2-(3-metho...)
Affinity DataIC50:  234nM. Assay description: Plasma kallikrein inhibitory activity in vitro was determined using standard published methods (see e.g. Johansen et al., Int. J. Tiss. Reac. 1986, 8...
Ligand InfoPC cidPC sid
In DepthDetails US Patent
TargetKallikrein-1(Homo sapiens (Human))
Kalvista Pharmaceuticals
US Patent
LigandPNGBDBM359706(N-[(1-Aminoisoquinolin-6-yl)methyl]-5-{[2-(3-metho...)
Affinity DataIC50:  9.85E+3nM. Assay description: KLK1 inhibitory activity in vitro was determined using standard published methods (see e.g. Johansen et al., Int. J. Tiss. Reac. 1986, 8, 185; Shori ...
Ligand InfoPC cidPC sid
In DepthDetails US Patent