BDBM359826 N-((4,6-Dimethyl-2-oxo-1,2-dihydropyridin-3-yl)methyl)-7-(4-(piperidin-1-ylmethyl)phenyl)-2H-spiro[benzofuran-3,1′-cyclopentane]-5-carboxamide::US9822103, Example 78
SMILES Cc1cc(C)c(CNC(=O)c2cc3c(OCC33CCCC3)c(c2)-c2ccc(CN3CCCCC3)cc2)c(=O)[nH]1
InChI Key InChIKey=VPHDXDLUEJPDSS-UHFFFAOYSA-N
Data  1 IC50
  Tab Delimited (TSV)   2D SDfile   Computed 3D by Vconf -m prep SDfile
Find this compound or compounds like it in BindingDB:
Activity Spreadsheet -- Enzyme Inhibition Constant Data from BindingDB
Found 1 hit for monomerid = 359826
TargetHistone-lysine N-methyltransferase EZH2(Homo sapiens (Human))
Bristol-Myers Squibb
US Patent
LigandPNGBDBM359826(N-((4,6-Dimethyl-2-oxo-1,2-dihydropyridin-3-yl)met...)
Affinity DataIC50: >1.00E+3nM. Assay description: EZH2 Histone Methyl Transferase Assay: The effectiveness of compounds of the present invention as inhibitors of histone methyl transferases can be r...
Ligand InfoPC cidPC sid
In DepthDetails US Patent