BDBM359846 2-Methyl-N-((6-methyl-2-oxo-4-propyl-1,2-dihydropyridin-3-yl)methyl)-7-(2-(piperazin-1-yl)pyrimidin-5-yl)-2-(prop-1-en-2-yl)-2,3-dihydrobenzofuran-5-carboxamide, 2 HCl::US9822103, Example 94
SMILES CCCc1cc(C)[nH]c(=O)c1CNC(=O)c1cc2CC(C)(Oc2c(c1)-c1cnc(nc1)N1CCNCC1)C(C)=C
InChI Key
Data  1 IC50
  Tab Delimited (TSV)   2D SDfile   Computed 3D by Vconf -m prep SDfile
Find this compound or compounds like it in BindingDB:
Activity Spreadsheet -- Enzyme Inhibition Constant Data from BindingDB
Found 1 hit for monomerid = 359846
TargetHistone-lysine N-methyltransferase EZH2(Homo sapiens (Human))
Bristol-Myers Squibb
US Patent
LigandPNGBDBM359846(2-Methyl-N-((6-methyl-2-oxo-4-propyl-1,2-dihydropy...)
Affinity DataIC50: <500nM. Assay description: EZH2 Histone Methyl Transferase Assay: The effectiveness of compounds of the present invention as inhibitors of histone methyl transferases can be r...
Ligand InfoPC cidPC sid
In DepthDetails US Patent