BDBM359862 US9822120, Compound 16
SMILES Cc1ncc(COc2cc(F)cc(Oc3ccc(cc3)-c3nc([C@H]4C[C@@](C)(O)C4)n4ccnc(N)c34)c2)s1
InChI Key InChIKey=IAEQDDVJTMBINP-CHOKWEPUSA-N
Data  1 KI  1 EC50
  Tab Delimited (TSV)   2D SDfile   Computed 3D by Vconf -m prep SDfile
Find this compound or compounds like it in BindingDB:
Activity Spreadsheet -- Enzyme Inhibition Constant Data from BindingDB
Found 2 hits for monomerid = 359862
TargetTyrosine-protein kinase BTK(Homo sapiens (Human))
Pharmascience
US Patent
LigandPNGBDBM359862(US9822120, Compound 16)
Affinity DataKi: <100nM. Assay description: Method A: Fluorescence polarization-based kinase assays were performed in 384 well-plate format using histidine tagged recombinant human full-length ...
Ligand InfoPC cidPC sid
In DepthDetails US Patent
TargetTyrosine-protein kinase BTK(Homo sapiens (Human))
Pharmascience
US Patent
LigandPNGBDBM359862(US9822120, Compound 16)
Affinity DataEC50: <100nM. Assay description: Method A: Fluorescence polarization-based kinase assays were performed in 384 well-plate format using histidine tagged recombinant human full-length ...
Ligand InfoPC cidPC sid
In DepthDetails US Patent