BDBM359880 N-(4-((3S,5R)-3-Amino-5-methylpiperidin-1-yl)pyridin-3-yl)-2-propylfuro[3,2-b]pyridine-5-carboxamide::US9822124, Example 1
SMILES CCCc1cc2nc(ccc2o1)C(=O)Nc1cnccc1N1C[C@H](C)C[C@H](N)C1
InChI Key InChIKey=UYKXRHYSRQTNKF-CABCVRRESA-N
Data  3 IC50
  Tab Delimited (TSV)   2D SDfile   Computed 3D by Vconf -m prep SDfile
Find this compound or compounds like it in BindingDB:
Activity Spreadsheet -- Enzyme Inhibition Constant Data from BindingDB
Found 3 hits for monomerid = 359880
TargetSerine/threonine-protein kinase pim-1(Homo sapiens (Human))
Incyte
US Patent
LigandPNGBDBM359880(N-(4-((3S,5R)-3-Amino-5-methylpiperidin-1-yl)pyrid...)
Affinity DataIC50: <10nM. Assay description: Pim-1 and Pim-3 kinase assays 20 μL reactions were run in white 384 well polystyrene plates dotted with 0.8 μL compound/DMSO in the assay b...
Ligand InfoPC cidPC sid
In DepthDetails US Patent
TargetSerine/threonine-protein kinase pim-3(Homo sapiens (Human))
Incyte
US Patent
LigandPNGBDBM359880(N-(4-((3S,5R)-3-Amino-5-methylpiperidin-1-yl)pyrid...)
Affinity DataIC50: <10nM. Assay description: Pim-1 and Pim-3 kinase assays 20 μL reactions were run in white 384 well polystyrene plates dotted with 0.8 μL compound/DMSO in the assay b...
Ligand InfoPC cidPC sid
In DepthDetails US Patent
TargetSerine/threonine-protein kinase pim-2(Homo sapiens (Human))
Incyte
US Patent
LigandPNGBDBM359880(N-(4-((3S,5R)-3-Amino-5-methylpiperidin-1-yl)pyrid...)
Affinity DataIC50:  550nM. Assay description: Pim-2 kinase assay—20 μL reactions were run in white 384 well polystyrene plates dotted with 0.8 μL compound/DMSO in the assay buffer ...
Ligand InfoPC cidPC sid
In DepthDetails US Patent