BDBM360198 (R)-(1-methyl-::US9828339, Example 114
SMILES CN1CC[C@@H](COC(=O)Nc2ccccc2-c2ccc(F)cc2)C1
InChI Key InChIKey=GKEJDUKDRJJIQK-CQSZACIVSA-N
Data  1 KI
  Tab Delimited (TSV)   2D SDfile   Computed 3D by Vconf -m prep SDfile
Find this compound or compounds like it in BindingDB:
Activity Spreadsheet -- Enzyme Inhibition Constant Data from BindingDB
Found 1 hit for monomerid = 360198
TargetMuscarinic acetylcholine receptor M3(Homo sapiens (Human))
Dong-A St
US Patent
LigandPNGBDBM360198((R)-(1-methyl- | US9828339, Example 114)
Affinity DataKi:  4.23nM. Assay description: Cell membrane proteins (Perkin Elmer) wherein human muscarinic M3 receptor was overexpressed, [3H]-methyl scopolamine and test compounds in various c...
Ligand InfoPC cidPC sid
In DepthDetails US Patent