BDBM360460 N-((5-(3-methoxyphenyl)isoquinolin- 8-yl)methyl)isoquinoline-4- carboxamide::US9828369, Example 33
SMILES COc1cccc(c1)-c1ccc(CNC(=O)c2cncc3ccccc23)c2cnccc12
InChI Key InChIKey=WNWNLPRCYFSKCT-UHFFFAOYSA-N
Data  1 IC50
  Tab Delimited (TSV)   2D SDfile   Computed 3D by Vconf -m prep SDfile
Find this compound or compounds like it in BindingDB:
Activity Spreadsheet -- Enzyme Inhibition Constant Data from BindingDB
Found 1 hit for monomerid = 360460
TargetDiacylglycerol O-acyltransferase 2(Homo sapiens (Human))
Merck Sharpe & Dohme
US Patent
LigandPNGBDBM360460(N-((5-(3-methoxyphenyl)isoquinolin- 8-yl)methyl)is...)
Affinity DataIC50:  3.41E+3nM. Assay description: DGAT2 activity was determined by measuring the amount of enzymatic product triolein (1,2,3-Tri(cis-9-octadecenoyl)glycerol) using the membrane prep m...
Ligand InfoPC cidPC sid
In DepthDetails US Patent