BDBM360550 2-(3-methoxyphenyl)-N-((5-(3- methoxyphenyl)isoquinolin-8- yl)methyl)cyclopropanecarboxamide::US9828369, Example 107
SMILES COc1cccc(c1)C1CC1C(=O)NCc1ccc(-c2cccc(OC)c2)c2ccncc12
InChI Key InChIKey=ARHJMZVJAPOTPO-UHFFFAOYSA-N
Data  1 IC50
  Tab Delimited (TSV)   2D SDfile   Computed 3D by Vconf -m prep SDfile
Find this compound or compounds like it in BindingDB:
Activity Spreadsheet -- Enzyme Inhibition Constant Data from BindingDB
Found 1 hit for monomerid = 360550
TargetDiacylglycerol O-acyltransferase 2(Homo sapiens (Human))
Merck Sharpe & Dohme
US Patent
LigandPNGBDBM360550(2-(3-methoxyphenyl)-N-((5-(3- methoxyphenyl)isoqui...)
Affinity DataIC50:  1.18E+3nM. Assay description: DGAT2 activity was determined by measuring the amount of enzymatic product triolein (1,2,3-Tri(cis-9-octadecenoyl)glycerol) using the membrane prep m...
Ligand InfoPC cidPC sid
In DepthDetails US Patent