BDBM360594 US9828369, Example 151
SMILES COc1cccc(c1)-c1ccc(CNC(=O)Nc2ccc(OC(F)(F)F)cc2)c2cnccc12
InChI Key InChIKey=IWSRPRFWTWECSP-UHFFFAOYSA-N
Data  1 IC50
  Tab Delimited (TSV)   2D SDfile   Computed 3D by Vconf -m prep SDfile
Find this compound or compounds like it in BindingDB:
Activity Spreadsheet -- Enzyme Inhibition Constant Data from BindingDB
Found 1 hit for monomerid = 360594
TargetDiacylglycerol O-acyltransferase 2(Homo sapiens (Human))
Merck Sharpe & Dohme
US Patent
LigandPNGBDBM360594(US9828369, Example 151)
Affinity DataIC50:  938nM. Assay description: DGAT2 activity was determined by measuring the amount of enzymatic product triolein (1,2,3-Tri(cis-9-octadecenoyl)glycerol) using the membrane prep m...
Ligand InfoPC cidPC sid
In DepthDetails US Patent