BDBM360646 (11bR)-N-(5-cyclopropylpyrimidin-2-yl)-8-fluoro-2,3,4,6,7,11b-hexahydro-1H-pyrazino[2,1-a]isoquinolin-9-amine::US9828374, Example 33
SMILES Fc1c(Nc2ncc(cn2)C2CC2)ccc2[C@@H]3CNCCN3CCc12
InChI Key InChIKey=QVSZYGTXOWBVAA-KRWDZBQOSA-N
Data  2 KI
  Tab Delimited (TSV)   2D SDfile   Computed 3D by Vconf -m prep SDfile
Find this compound or compounds like it in BindingDB:
Activity Spreadsheet -- Enzyme Inhibition Constant Data from BindingDB
Found 2 hits for monomerid = 360646
TargetTrace amine-associated receptor 1(Rattus norvegicus (Rat))
Hoffmann-La Roche
US Patent
LigandPNGBDBM360646((11bR)-N-(5-cyclopropylpyrimidin-2-yl)-8-fluoro-2,...)
Affinity DataKi:  67.7nM. Assay description: The TAAR1 radioligand 3[H]-(S)-4-[(ethyl-phenyl-amino)-methyl]-4,5-dihydro-oxazol-2-ylamine (described in WO 2008/098857) was used at a concentration...
Ligand InfoPC cidPC sid
In DepthDetails US Patent
TargetTrace amine-associated receptor 1(Mus musculus (Mouse))
Hoffmann-La Roche
US Patent
LigandPNGBDBM360646((11bR)-N-(5-cyclopropylpyrimidin-2-yl)-8-fluoro-2,...)
Affinity DataKi:  106nM. Assay description: HEK-293 cells stably expressing mouse TAAR1 were maintained at 37° C. and 5% CO2 in DMEM high glucose medium, containing fetal calf serum (10%, heat ...
Ligand InfoPC cidPC sid
In DepthDetails US Patent