BDBM360692 US9828381, 2-10
SMILES CC(c1cc2nc(C)cc(N3CCC[C@H](O)C3)n2n1)c1ccc(Cl)cc1
InChI Key InChIKey=VFCHRRLGPPLBFD-JRZJBTRGSA-N
Data  1 EC50
  Tab Delimited (TSV)   2D SDfile   Computed 3D by Vconf -m prep SDfile
Find this compound or compounds like it in BindingDB:
Activity Spreadsheet -- Enzyme Inhibition Constant Data from BindingDB
Found 1 hit for monomerid = 360692
TargetGamma-aminobutyric acid type B receptor subunit 2(Rattus norvegicus)
Abbvie Deutschland
US Patent
LigandPNGBDBM360692(US9828381, 2-10)
Affinity DataEC50:  152nM. Assay description: The composition of the assay mixtures [in a final volume of 200 μL in 96-well U-bottom plates (Greiner) was as follows: 50 mM Tris-HCl buffer, p...
Ligand InfoPC cidPC sid
In DepthDetails US Patent