BDBM360784 1-(2-((2S,4R)-4-fluoro-2-(6- (trifluoromethyl)pyridin-2- ylcarbamoyl)pyrrolidin-1- yl)-2-oxoethyl)-5- (pyrimidin-2-ylethynyl)-1H- indazole-3-carboxamide::US9828396, Compound 33
SMILES NC(=O)c1nn(CC(=O)N2C[C@H](F)C[C@H]2C(=O)Nc2cccc(n2)C(F)(F)F)c2ccc(cc12)C#Cc1ncccn1
InChI Key InChIKey=SOVQYSXTSGFFTO-APWZRJJASA-N
Data  1 IC50
  Tab Delimited (TSV)   2D SDfile   Computed 3D by Vconf -m prep SDfile
Find this compound or compounds like it in BindingDB:
Activity Spreadsheet -- Enzyme Inhibition Constant Data from BindingDB
Found 1 hit for monomerid = 360784
TargetComplement factor D(Homo sapiens (Human))
Achillion Pharmaceuticals
US Patent
LigandPNGBDBM360784(1-(2-((2S,4R)-4-fluoro-2-(6- (trifluoromethyl)pyri...)
Affinity DataIC50: <1.00E+3nM. Assay description: Human factor D (purified from human serum, Complement Technology, Inc.) at 80 nM final concentration is incubated with test compound at various conce...
Ligand InfoPC cidPC sid
In DepthDetails US Patent