BDBM360819 1-(2-((2S,4R)-2-(5- bromopyridin-3- ylcarbamoyl)-4- fluoropyrrolidin-1-yl)-2- oxoethyl)-5-((5- fluoropyrimidin-2- yl)ethynyl)-1H-indazole-3- carboxamide::US9828396, Compound 68
SMILES NC(=O)c1nn(CC(=O)N2C[C@H](F)C[C@H]2C(=O)Nc2cncc(Br)c2)c2ccc(cc12)C#Cc1ncc(F)cn1
InChI Key InChIKey=ZHBOTTFEMNMJDS-IERDGZPVSA-N
Data  1 IC50
  Tab Delimited (TSV)   2D SDfile   Computed 3D by Vconf -m prep SDfile
Find this compound or compounds like it in BindingDB:
Activity Spreadsheet -- Enzyme Inhibition Constant Data from BindingDB
Found 1 hit for monomerid = 360819
TargetComplement factor D(Homo sapiens (Human))
Achillion Pharmaceuticals
US Patent
LigandPNGBDBM360819(1-(2-((2S,4R)-2-(5- bromopyridin-3- ylcarbamoyl)-4...)
Affinity DataIC50: <1.00E+3nM. Assay description: Human factor D (purified from human serum, Complement Technology, Inc.) at 80 nM final concentration is incubated with test compound at various conce...
Ligand InfoPC cidPC sid
In DepthDetails US Patent