BDBM360834 1-(2-((2S,4R)-2-(2'-chloro- 2-fluorobiphenyl-3- ylcarbamoyl)-4- fluoropyrrolidin-1-yl)-2- oxoethyl)-5-(pyrazin-2- ylethynyl)-1H-indazole-3- carboxamide::US9828396, Compound 83
SMILES NC(=O)c1nn(CC(=O)N2C[C@H](F)C[C@H]2C(=O)Nc2cccc(c2F)-c2ccccc2Cl)c2ccc(cc12)C#Cc1cnccn1
InChI Key InChIKey=KYLJSICUJMEXRI-NGOKVRLYSA-N
Data  1 IC50
  Tab Delimited (TSV)   2D SDfile   Computed 3D by Vconf -m prep SDfile
Find this compound or compounds like it in BindingDB:
Activity Spreadsheet -- Enzyme Inhibition Constant Data from BindingDB
Found 1 hit for monomerid = 360834
TargetComplement factor D(Homo sapiens (Human))
Achillion Pharmaceuticals
US Patent
LigandPNGBDBM360834(1-(2-((2S,4R)-2-(2'-chloro- 2-fluorobiphenyl-3- yl...)
Affinity DataIC50: <1.00E+3nM. Assay description: Human factor D (purified from human serum, Complement Technology, Inc.) at 80 nM final concentration is incubated with test compound at various conce...
Ligand InfoPC cidPC sid
In DepthDetails US Patent