BDBM360939 2-(4-(2- aminobenzo [d]thiazol-4-yl)-2- sulfamoyl-3- (1H-tetrazol-5- yl)phenyl- sulfonamido)-8- oxabicyclo[3.2.1] octan-6-aminium 2,2,2- trifluoroacetate::US10221163, Example 95::US10544130, Example 95
SMILES NC1CC2OC1CCC2NS(=O)(=O)c1ccc(-c2cccc3sc(N)nc23)c(-c2nnn[nH]2)c1S(N)(=O)=O
InChI Key
Data  6 IC50
  Tab Delimited (TSV)   2D SDfile   Computed 3D by Vconf -m prep SDfile
Find this compound or compounds like it in BindingDB:
Activity Spreadsheet -- Enzyme Inhibition Constant Data from BindingDB
Found 6 hits for monomerid = 360939
TargetMetallo-beta-lactamase type 2(Serratia marcescens)
Merck Sharp & Dohme
US Patent
LigandPNGBDBM360939(2-(4-(2- aminobenzo [d]thiazol-4-yl)-2- sulfamoyl-...)
Affinity DataIC50:  0.193nM. Assay description: The Class B enzyme activities were measured in the presence of the test inhibitor in a fluorescence assay against a commercially available substrate ...
Ligand InfoPC cidPC sid
In DepthDetails US Patent
TargetMetallo-beta-lactamase type 2(Klebsiella pneumoniae)
Merck Sharp & Dohme
US Patent
LigandPNGBDBM360939(2-(4-(2- aminobenzo [d]thiazol-4-yl)-2- sulfamoyl-...)
Affinity DataIC50:  0.0270nM. Assay description: The Class B enzyme activities were measured in the presence of the test inhibitor in a fluorescence assay against a commercially available substrate ...
Ligand InfoPC cidPC sid
In DepthDetails US Patent
TargetBeta-lactamase()
Merck Sharp & Dohme
US Patent
LigandPNGBDBM360939(2-(4-(2- aminobenzo [d]thiazol-4-yl)-2- sulfamoyl-...)
Affinity DataIC50:  0.173nM
Ligand InfoPC cidPC sid
In DepthDetails US Patent
TargetMetallo-beta-lactamase type 2(Serratia marcescens)
Merck Sharp & Dohme
US Patent
LigandPNGBDBM360939(2-(4-(2- aminobenzo [d]thiazol-4-yl)-2- sulfamoyl-...)
Affinity DataIC50:  0.193nM. Assay description: The Class B enzyme activities were measured in the presence of the test inhibitor in a fluorescence assay against a commercially available substrate ...
Ligand InfoPC cidPC sid
In DepthDetails US Patent
TargetMetallo-beta-lactamase type 2(Klebsiella pneumoniae)
Merck Sharp & Dohme
US Patent
LigandPNGBDBM360939(2-(4-(2- aminobenzo [d]thiazol-4-yl)-2- sulfamoyl-...)
Affinity DataIC50:  0.0270nM
Ligand InfoPC cidPC sid
In DepthDetails US Patent
TargetVIM-1 metallo-beta-lactamase(Klebsiella pneumoniae)
Merck Sharp & Dohme
US Patent
LigandPNGBDBM360939(2-(4-(2- aminobenzo [d]thiazol-4-yl)-2- sulfamoyl-...)
Affinity DataIC50:  0.173nM. Assay description: The Class B enzyme activities were measured in the presence of the test inhibitor in a fluorescence assay against a commercially available substrate ...
Ligand InfoPC cidPC sid
In DepthDetails US Patent