BDBM361279 US10221163, Example 436::US10544130, Example 436
SMILES NCC(CN)NS(=O)(=O)c1ccc(-c2cccc3sc(N)nc23)c(-c2nn[nH]n2)c1S(N)(=O)=O
InChI Key InChIKey=HLXWUESRDMZWKV-UHFFFAOYSA-N
Data  6 IC50
  Tab Delimited (TSV)   2D SDfile   Computed 3D by Vconf -m prep SDfile
Find this compound or compounds like it in BindingDB:
Activity Spreadsheet -- Enzyme Inhibition Constant Data from BindingDB
Found 6 hits for monomerid = 361279
TargetMetallo-beta-lactamase type 2(Serratia marcescens)
Merck Sharp & Dohme
US Patent
LigandPNGBDBM361279(US10221163, Example 436 | US10544130, Example 436)
Affinity DataIC50:  0.103nM. Assay description: The Class B enzyme activities were measured in the presence of the test inhibitor in a fluorescence assay against a commercially available substrate ...
Ligand InfoPC cidPC sid
In DepthDetails US Patent
TargetMetallo-beta-lactamase type 2(Klebsiella pneumoniae)
Merck Sharp & Dohme
US Patent
LigandPNGBDBM361279(US10221163, Example 436 | US10544130, Example 436)
Affinity DataIC50:  0.0250nM. Assay description: The Class B enzyme activities were measured in the presence of the test inhibitor in a fluorescence assay against a commercially available substrate ...
Ligand InfoPC cidPC sid
In DepthDetails US Patent
TargetBeta-lactamase()
Merck Sharp & Dohme
US Patent
LigandPNGBDBM361279(US10221163, Example 436 | US10544130, Example 436)
Affinity DataIC50:  0.116nM
Ligand InfoPC cidPC sid
In DepthDetails US Patent
TargetMetallo-beta-lactamase type 2(Serratia marcescens)
Merck Sharp & Dohme
US Patent
LigandPNGBDBM361279(US10221163, Example 436 | US10544130, Example 436)
Affinity DataIC50:  0.103nM. Assay description: The Class B enzyme activities were measured in the presence of the test inhibitor in a fluorescence assay against a commercially available substrate ...
Ligand InfoPC cidPC sid
In DepthDetails US Patent
TargetMetallo-beta-lactamase type 2(Klebsiella pneumoniae)
Merck Sharp & Dohme
US Patent
LigandPNGBDBM361279(US10221163, Example 436 | US10544130, Example 436)
Affinity DataIC50:  0.0250nM
Ligand InfoPC cidPC sid
In DepthDetails US Patent
TargetVIM-1 metallo-beta-lactamase(Klebsiella pneumoniae)
Merck Sharp & Dohme
US Patent
LigandPNGBDBM361279(US10221163, Example 436 | US10544130, Example 436)
Affinity DataIC50:  0.116nM. Assay description: The Class B enzyme activities were measured in the presence of the test inhibitor in a fluorescence assay against a commercially available substrate ...
Ligand InfoPC cidPC sid
In DepthDetails US Patent